Target
Mitogen-activated protein kinase 1
Ligand
BDBM120105
Substrate
Meas. Tech.
Enzymatic Assay
pH
7.3±n/a
IC50
10.4±n/a nM
Comments
extracted
Citation
 Blake, JFChicarelli, MJGarrey, RFGaudino, JGrina, JMoreno, DAMohr, PJRen, LSchwarz, JChen, HRobarge, KZhou, A Serine/threonine kinase inhibitors US Patent  US8697715 Publication Date 4/15/2014 
Target
Name:
Mitogen-activated protein kinase 1
Synonyms:
ERK2 Extracellular signal-regulated kinase 2 Extracellular signal-regulated kinase 2 (ERK2) MAPK 2 MK01_HUMAN Mitogen-activated protein kinase 1 (ERK-2) Mitogen-activated protein kinase 2 PRKM2 | p42-MAPK
Type:
Ser/Thr Protein Kinase
Mol. Mass.:
41392.76
Organism:
Homo sapiens (Human)
Description:
P28482
Residue:
360
  
Inhibitor
Name:
BDBM120105
Synonyms:
US8697715, 103 | US9259470, 103
Type:
Small organic molecule
Emp. Form.:
C22H22F2N4O3
Mol. Mass.:
428.4319
SMILES:
OC[C@H](c1cc(F)cc(F)c1)n1ccc(cc1=O)-c1ccnc(NC2CCOCC2)n1
: