Target
Non-receptor tyrosine-protein kinase TYK2
Ligand
BDBM120140
Substrate
Meas. Tech.
Inhibition Assay
pH
7.2±n/a
Temperature
295.15±n/a K
Ki
0.4±n/a nM
Comments
extracted
Citation
 Blench, TJEllwood, CGoodacre, SCLai, YLiang, JMacleod, CMagnuson, SRTsui, VHWilliams, KZhang, B Azabenzothiazole compounds, compositions and methods of use US Patent  US8697708 Publication Date 4/15/2014 
Target
Name:
Non-receptor tyrosine-protein kinase TYK2
Synonyms:
Non-receptor tyrosine-protein kinase TYK2 (TYK2) TYK2_HUMAN | Tyrosine-protein kinase TYK2
Type:
Protein
Mol. Mass.:
133666.03
Organism:
Homo sapiens (Human)
Description:
P29597
Residue:
1187
  
Inhibitor
Name:
BDBM120140
Synonyms:
US8697708, 223
Type:
Small organic molecule
Emp. Form.:
C17H9ClFN7S
Mol. Mass.:
397.817
SMILES:
Nc1cc(Nc2ncc(C#N)c3nc(sc23)-c2c(F)cccc2Cl)ncn1
: