Target
Stromelysin-2
Ligand
BDBM120163
Substrate
Meas. Tech.
Inhibition Assay
Ki
556±n/a nM
Citation
 Devel, LBeau, FCzarny, BDive, V Pseudodipeptides as MMP inhibitors US Patent  US8691753 Publication Date 4/8/2014 
Target
Name:
Stromelysin-2
Synonyms:
MMP10 Matrix Metalloproteinase-10 (MMP-10) STMY2
Type:
Enzyme
Mol. Mass.:
54143.02
Organism:
Homo sapiens (Human)
Description:
P09238
Residue:
476
  
Inhibitor
Name:
BDBM120163
Synonyms:
US8691753, 11
Type:
Small organic molecule
Emp. Form.:
C28H31ClN4O6
Mol. Mass.:
555.022
SMILES:
CC[C@H](NC(=O)[C@H](CCCOC=O)NC(=O)CCc1cc(no1)-c1ccc(cc1)-c1cccc(Cl)c1)C(N)=O
: