Target
Lysine-specific histone demethylase 1A
Ligand
BDBM283316
Substrate
Meas. Tech.
In Vitro Enzyme Inhibition LSD-1 Assay
Temperature
298.15±n/a K
IC50
<100±n/a nM
Comments
extracted
Citation
 Chen, YKKanouni, TKaldor, SWStafford, JAVeal, JM Inhibitors of lysine specific demethylase-1 US Patent  US10023543 Publication Date 7/17/2018 
Target
Name:
Lysine-specific histone demethylase 1A
Synonyms:
AOF2 Flavin-containing amine oxidase domain-containing protein 2 KDM1A KIAA0601 Lysine-specific demethylase 1 (LSD1) Lysine-specific histone demethylase 1 (LSD1)
Type:
Enzyme
Mol. Mass.:
92901.01
Organism:
Homo sapiens (Human)
Description:
O60341
Residue:
852
  
Inhibitor
Name:
BDBM283316
Synonyms:
4-[2-(4-aminopiperidin-1-yl)-5-(6- ethoxy-5-fluoropyridin-3-yl)-1- methyl-6-oxopyrimidin-4-yl]-2- fluorobenzonitrile | US10023543, Example 93
Type:
Small organic molecule
Emp. Form.:
C24H24F2N6O2
Mol. Mass.:
466.4832
SMILES:
CCOc1ncc(cc1F)-c1c(nc(N2CCC(N)CC2)n(C)c1=O)-c1ccc([N+]#[C-])c(F)c1
: