Target
Lysine-specific histone demethylase 1A
Ligand
BDBM283320
Substrate
Meas. Tech.
In Vitro Enzyme Inhibition LSD-1 Assay
Temperature
298.15±n/a K
IC50
<100±n/a nM
Comments
extracted
Citation
 Chen, YKKanouni, TKaldor, SWStafford, JAVeal, JM Inhibitors of lysine specific demethylase-1 US Patent  US10023543 Publication Date 7/17/2018 
Target
Name:
Lysine-specific histone demethylase 1A
Synonyms:
AOF2 Flavin-containing amine oxidase domain-containing protein 2 KDM1A KIAA0601 Lysine-specific demethylase 1 (LSD1) Lysine-specific histone demethylase 1 (LSD1)
Type:
Enzyme
Mol. Mass.:
92901.01
Organism:
Homo sapiens (Human)
Description:
O60341
Residue:
852
  
Inhibitor
Name:
BDBM283320
Synonyms:
4-[2-(4-aminopiperidin-1-yl)-5-[4-(2- hydroxyethoxy)phenyl]-1-methyl-6- oxopyrimidin-4-yl]benzonitrile | US10023543, Example 97
Type:
Small organic molecule
Emp. Form.:
C25H27N5O3
Mol. Mass.:
445.5136
SMILES:
Cn1c(nc(-c2ccc(cc2)[N+]#[C-])c(-c2ccc(OCCO)cc2)c1=O)N1CCC(N)CC1
: