Target
Dihydroorotate dehydrogenase (quinone), mitochondrial
Ligand
BDBM92606
Substrate
Meas. Tech.
Enzymatic Assays
IC50
40±n/a nM
Citation
 Bastos, CBooker, MLCelatka, CAClardy, JCCortese, JPatel, VPSkerlj, RWiegand, RCWirth, DF Small molecule inhibitors of Plasmodium falciparum dihydroorotate dehydrogenase US Patent  US8703811 Publication Date 4/22/2014 
Target
Name:
Dihydroorotate dehydrogenase (quinone), mitochondrial
Synonyms:
Dihydroorotate Dehydrogenase (DHODH) | Dihydroorotate dehydrogenase, mitochondrial, putative
Type:
PROTEIN
Mol. Mass.:
62972.27
Organism:
Plasmodium vivax
Description:
A5K1N1
Residue:
572
  
Inhibitor
Name:
BDBM92606
Synonyms:
DHOD Inhibitor, 5 | US8703811, 6
Type:
Small molecule
Emp. Form.:
C18H23NO3
Mol. Mass.:
301.3801
SMILES:
CCOC(=O)c1[nH]c(C)c(Cc2ccc(OCC)cc2)c1C
: