Target
Plasma kallikrein
Ligand
BDBM283448
Substrate
Meas. Tech.
In Vitro Contact Cellular Assay
EC50
<100±n/a nM
Citation
 McDonald, AQian, S Therapeutic inhibitory compounds US Patent  US10023557 Publication Date 7/17/2018 
Target
Name:
Plasma kallikrein
Synonyms:
Fletcher factor KLKB1 Kallikrein Plasma kallikrein heavy chain Plasma prekallikrein
Type:
Protein
Mol. Mass.:
71391.16
Organism:
Homo sapiens (Human)
Description:
P03952
Residue:
638
  
Inhibitor
Name:
BDBM283448
Synonyms:
N-((6-amino-2,4-dimethylpyridin-3-yl)methyl)- 2-((3,8-dichloroquinolin-6- yl)methyl)isonicotinamide US10266515, Example 100 US11021463, Example 100 | US9611252, Example 100
Type:
Small organic molecule
Emp. Form.:
C24H21Cl2N5O
Mol. Mass.:
466.362
SMILES:
Cc1cc(N)nc(C)c1CNC(=O)c1ccnc(Cc2cc(Cl)c3ncc(Cl)cc3c2)c1
: