Target
Plasma kallikrein
Ligand
BDBM283466
Substrate
Meas. Tech.
In Vitro Contact Cellular Assay
EC50
<100±n/a nM
Citation
 McDonald, AQian, S Therapeutic inhibitory compounds US Patent  US10023557 Publication Date 7/17/2018 
Target
Name:
Plasma kallikrein
Synonyms:
Fletcher factor KLKB1 Kallikrein Plasma kallikrein heavy chain Plasma prekallikrein
Type:
Protein
Mol. Mass.:
71391.16
Organism:
Homo sapiens (Human)
Description:
P03952
Residue:
638
  
Inhibitor
Name:
BDBM283466
Synonyms:
N-((1-aminoisoquinolin-6-yl)methyl)-2-((6- fluoroquinolin-3-yl)methyl)isonicotinamide US10266515, Example 118 US11021463, Example 118 | US9611252, Example 118
Type:
Small organic molecule
Emp. Form.:
C26H20FN5O
Mol. Mass.:
437.4683
SMILES:
Nc1nccc2cc(CNC(=O)c3ccnc(Cc4cnc5ccc(F)cc5c4)c3)ccc12
: