Target
Plasma kallikrein
Ligand
BDBM283496
Substrate
Meas. Tech.
In Vitro Contact Cellular Assay
EC50
<100±n/a nM
Citation
 McDonald, AQian, S Therapeutic inhibitory compounds US Patent  US10023557 Publication Date 7/17/2018 
Target
Name:
Plasma kallikrein
Synonyms:
Fletcher factor KLKB1 Kallikrein Plasma kallikrein heavy chain Plasma prekallikrein
Type:
Protein
Mol. Mass.:
71391.16
Organism:
Homo sapiens (Human)
Description:
P03952
Residue:
638
  
Inhibitor
Name:
BDBM283496
Synonyms:
N-((6-amino-2,4-dimethylpyridin-3-yl)methyl)- 2-((3-chloro-1,7-naphthyridin-6- yl)methyl)isonicotinamide US10308637, Example 148
Type:
Small organic molecule
Emp. Form.:
C23H21ClN6O
Mol. Mass.:
432.905
SMILES:
Cc1cc(N)nc(C)c1CNC(=O)c1ccnc(Cc2cc3cc(Cl)cnc3cn2)c1
: