Target
Plasma kallikrein
Ligand
BDBM283593
Substrate
Meas. Tech.
In Vitro Contact Cellular Assay
EC50
<100±n/a nM
Citation
 McDonald, AQian, S Therapeutic inhibitory compounds US Patent  US10023557 Publication Date 7/17/2018 
Target
Name:
Plasma kallikrein
Synonyms:
Fletcher factor KLKB1 Kallikrein Plasma kallikrein heavy chain Plasma prekallikrein
Type:
Protein
Mol. Mass.:
71391.16
Organism:
Homo sapiens (Human)
Description:
P03952
Residue:
638
  
Inhibitor
Name:
BDBM283593
Synonyms:
N-((6-amino-2,4-dimethylpyridin-3-yl)methyl)- 2-((8-(aminomethyl)-3-chloroquinolin-6- yl)methyl)isonicotinamide US10308637, Example 241
Type:
Small organic molecule
Emp. Form.:
C25H25ClN6O
Mol. Mass.:
460.959
SMILES:
Cc1cc(N)nc(C)c1CNC(=O)c1ccnc(Cc2cc(CN)c3ncc(Cl)cc3c2)c1
: