Target
Cathepsin H
Ligand
BDBM120830
Substrate
Meas. Tech.
Enzymatic activity assay
pH
6±n/a
Temperature
310.15±n/a K
Ki
32±0.32 nM
Comments
extracted
Citation
 Raghav, NGarg, S N-formylpyrazolines and N-benzoylpyrazolines as novel inhibitors of mammalian cathepsin B and cathepsin H. Bioorg Chem 57:43-50 (2014)  
Target
Name:
Cathepsin H
Synonyms:
Type:
Protein
Mol. Mass.:
37394.24
Organism:
Capra hircus (Goat)
Description:
A0A060INS8
Residue:
335
  
Inhibitor
Name:
BDBM120830
Synonyms:
N-benzoyl-3,5-diphenylpyrazoline (2a)
Type:
Small organic molecule
Emp. Form.:
C22H18N2O
Mol. Mass.:
326.3911
SMILES:
O=C(N1N=C(CC1c1ccccc1)c1ccccc1)c1ccccc1
: