Target
Cathepsin H
Ligand
BDBM120833
Substrate
Meas. Tech.
Enzymatic activity assay
pH
6±n/a
Temperature
310.15±n/a K
Ki
30.1±0.3 nM
Comments
extracted
Citation
 Raghav, NGarg, S N-formylpyrazolines and N-benzoylpyrazolines as novel inhibitors of mammalian cathepsin B and cathepsin H. Bioorg Chem 57:43-50 (2014)  
Target
Name:
Cathepsin H
Synonyms:
Type:
Protein
Mol. Mass.:
37394.24
Organism:
Capra hircus (Goat)
Description:
A0A060INS8
Residue:
335
  
Inhibitor
Name:
BDBM120833
Synonyms:
N-benzoyl-5-(-4'-chloro phenyl)-3-phenylpyrazoline (2d)
Type:
Small organic molecule
Emp. Form.:
C22H17ClN2O
Mol. Mass.:
360.836
SMILES:
Clc1ccc(cc1)C1CC(=NN1C(=O)c1ccccc1)c1ccccc1
: