Target
Cathepsin H
Ligand
BDBM120835
Substrate
Meas. Tech.
Enzymatic activity assay
pH
6±n/a
Temperature
310.15±n/a K
Ki
50.3±5.01 nM
Comments
extracted
Citation
 Raghav, NGarg, S N-formylpyrazolines and N-benzoylpyrazolines as novel inhibitors of mammalian cathepsin B and cathepsin H. Bioorg Chem 57:43-50 (2014)  
Target
Name:
Cathepsin H
Synonyms:
Type:
Protein
Mol. Mass.:
37394.24
Organism:
Capra hircus (Goat)
Description:
A0A060INS8
Residue:
335
  
Inhibitor
Name:
BDBM120835
Synonyms:
N-benzoyl-5-(-3'-methoxy phenyl)-3-phenylpyrazoline (2f)
Type:
Small organic molecule
Emp. Form.:
C23H20N2O2
Mol. Mass.:
356.4171
SMILES:
COc1cccc(c1)C1CC(=NN1C(=O)c1ccccc1)c1ccccc1
: