Target
cAMP-specific 3',5'-cyclic phosphodiesterase 4A
Ligand
BDBM120860
Substrate
Meas. Tech.
Inhibition Assay
pH
7.5±n/a
Temperature
310.15±n/a K
IC50
1.3±n/a nM
Citation
 Jarnagin, KAkama, T Boron-containing small molecules US Patent  US8716478 Publication Date 5/6/2014 
Target
Name:
cAMP-specific 3',5'-cyclic phosphodiesterase 4A
Synonyms:
3',5'-cyclic phosphodiesterase PDE46 PDE4A_HUMAN Phosphodiesterase 4A | Phosphodiesterase 4A (PDE4)
Type:
Enzyme
Mol. Mass.:
98113.27
Organism:
Homo sapiens (Human)
Description:
P27815
Residue:
886
  
Inhibitor
Name:
BDBM120860
Synonyms:
US8716478, D246 | US9499570, D246
Type:
Small organic molecule
Emp. Form.:
C19H18BClN2O5
Mol. Mass.:
400.621
SMILES:
CC(=O)CCCOc1nc(Oc2cc3COB(O)c3c(C)c2)c(Cl)cc1C#N
: