Target
Serine/threonine-protein kinase Chk1
Ligand
BDBM120874
Substrate
Meas. Tech.
Inhibiting Assay
pH
7.5±n/a
IC50
16±n/a nM
Citation
 Boyle, RGWalker, DWBoyce, RJ Pharmaceutical compounds US Patent  US8716287 Publication Date 5/6/2014 
Target
Name:
Serine/threonine-protein kinase Chk1
Synonyms:
CHEK1 CHK1 checkpoint homolog Checkpoint kinase-1 (CHK1)
Type:
Enzyme Catalytic Domain
Mol. Mass.:
54443.02
Organism:
Homo sapiens (Human)
Description:
gi_166295192
Residue:
476
  
Inhibitor
Name:
BDBM120874
Synonyms:
US8716287, 7
Type:
Small organic molecule
Emp. Form.:
C22H20ClFN6O
Mol. Mass.:
438.885
SMILES:
Fc1ccc(CCNCCc2ccc(NC(=O)Nc3cnc(cn3)C#N)cc2Cl)cc1
: