Target
Serine/threonine-protein kinase Chk1
Ligand
BDBM120885
Substrate
Meas. Tech.
Inhibiting Assay
pH
7.5±n/a
IC50
21±n/a nM
Citation
 Boyle, RGWalker, DWBoyce, RJ Pharmaceutical compounds US Patent  US8716287 Publication Date 5/6/2014 
Target
Name:
Serine/threonine-protein kinase Chk1
Synonyms:
CHEK1 CHK1 checkpoint homolog Checkpoint kinase-1 (CHK1)
Type:
Enzyme Catalytic Domain
Mol. Mass.:
54443.02
Organism:
Homo sapiens (Human)
Description:
gi_166295192
Residue:
476
  
Inhibitor
Name:
BDBM120885
Synonyms:
US8716287, 18
Type:
Small organic molecule
Emp. Form.:
C22H20ClFN6O
Mol. Mass.:
438.885
SMILES:
C[C@H](NCCc1ccc(NC(=O)Nc2cnc(cn2)C#N)cc1Cl)c1ccc(F)cc1
: