Target
Serine/threonine-protein kinase Chk1
Ligand
BDBM120898
Substrate
Meas. Tech.
Inhibiting Assay
pH
7.5±n/a
IC50
2.7±n/a nM
Citation
 Boyle, RGWalker, DWBoyce, RJ Pharmaceutical compounds US Patent  US8716287 Publication Date 5/6/2014 
Target
Name:
Serine/threonine-protein kinase Chk1
Synonyms:
CHEK1 CHK1 checkpoint homolog Checkpoint kinase-1 (CHK1)
Type:
Enzyme Catalytic Domain
Mol. Mass.:
54443.02
Organism:
Homo sapiens (Human)
Description:
gi_166295192
Residue:
476
  
Inhibitor
Name:
BDBM120898
Synonyms:
US8716287, 31
Type:
Small organic molecule
Emp. Form.:
C23H23FN6O2
Mol. Mass.:
434.4661
SMILES:
COc1cc(CCNCCc2ccc(F)cc2)ccc1NC(=O)Nc1cnc(cn1)C#N
: