Target
Serine/threonine-protein kinase Chk1
Ligand
BDBM120902
Substrate
Meas. Tech.
Inhibiting Assay
pH
7.5±n/a
IC50
1.4±n/a nM
Citation
 Boyle, RGWalker, DWBoyce, RJ Pharmaceutical compounds US Patent  US8716287 Publication Date 5/6/2014 
Target
Name:
Serine/threonine-protein kinase Chk1
Synonyms:
CHEK1 CHK1 checkpoint homolog Checkpoint kinase-1 (CHK1)
Type:
Enzyme Catalytic Domain
Mol. Mass.:
54443.02
Organism:
Homo sapiens (Human)
Description:
gi_166295192
Residue:
476
  
Inhibitor
Name:
BDBM120902
Synonyms:
US8716287, 35
Type:
Small organic molecule
Emp. Form.:
C26H29ClN8O
Mol. Mass.:
505.014
SMILES:
CN1CCN(CC1)c1ccc(CNCCc2ccc(NC(=O)Nc3cnc(cn3)C#N)cc2Cl)cc1
: