Target
Cyclin-dependent kinase 9
Ligand
BDBM120935
Substrate
Meas. Tech.
In Vitro Kinase Inhibition Assays
pH
7.5±n/a
IC50
0.039±n/a nM
Comments
extracted
Citation
 Allgeier, HAugustin, MMüller, AZeitlmann, LMarquardt, APleiss, MAHeiser, UNiestroj, AJ Inhibitors of protein kinases US Patent  US8716296 Publication Date 5/6/2014 
Target
Name:
Cyclin-dependent kinase 9
Synonyms:
C-2K CDK9 Cell division cycle 2-like protein kinase 4 Cyclin-Dependent Kinase 9 (CDK9) Serine/threonine-protein kinase PITALRE Tat-associated kinase complex catalytic subunit
Type:
Enzyme Subunit
Mol. Mass.:
42789.13
Organism:
Homo sapiens (Human)
Description:
Residue:
372
  
Inhibitor
Name:
BDBM120935
Synonyms:
US8716296, 3
Type:
Small organic molecule
Emp. Form.:
C17H19FN4O2
Mol. Mass.:
330.3568
SMILES:
COc1cccc(F)c1-c1cc(NC(=O)C2CCCNC2)ncn1
: