Target
Trace amine-associated receptor 1
Ligand
BDBM283709
Substrate
Meas. Tech.
Radioligand Binding Assay on Rat TAAR1
pH
7.4±n/a
Ki
2.10±n/a nM
Comments
extracted
Citation
 Cecere, GGalley, GNorcross, RPflieger, PRauber, E Substituted azetidine derivatives US Patent  US10023559 Publication Date 7/17/2018 
Target
Name:
Trace amine-associated receptor 1
Synonyms:
TAAR1_RAT Taar1 Trace amine receptor 1 (TARR1) Trace amine-associated receptor 1 (TAAR1) Trar1
Type:
Enzyme
Mol. Mass.:
38034.73
Organism:
Rattus norvegicus (Rat)
Description:
Q923Y9
Residue:
332
  
Inhibitor
Name:
BDBM283709
Synonyms:
N-[4-(azetidin-3-yloxy)phenyl]-4-chloro-3-(4-chlorophenyl)-1H-pyrazole-5-carboxamide | US10023559, Example 34
Type:
Small organic molecule
Emp. Form.:
C19H16Cl2N4O2
Mol. Mass.:
403.262
SMILES:
Clc1c(n[nH]c1C(=O)Nc1ccc(OC2CNC2)cc1)-c1ccc(Cl)cc1
: