Target
Trace amine-associated receptor 1
Ligand
BDBM283729
Substrate
Meas. Tech.
Radioligand Binding Assay on Rat TAAR1
pH
7.4±n/a
Ki
18±n/a nM
Comments
extracted
Citation
 Cecere, GGalley, GNorcross, RPflieger, PRauber, E Substituted azetidine derivatives US Patent  US10023559 Publication Date 7/17/2018 
Target
Name:
Trace amine-associated receptor 1
Synonyms:
TAAR1_RAT Taar1 Trace amine receptor 1 (TARR1) Trace amine-associated receptor 1 (TAAR1) Trar1
Type:
Enzyme
Mol. Mass.:
38034.73
Organism:
Rattus norvegicus (Rat)
Description:
Q923Y9
Residue:
332
  
Inhibitor
Name:
BDBM283729
Synonyms:
6-chloro-N-[4-[(3-fluoroazetidin-3-yl)methyl]phenyl]pyridine-3-carboxamide | US10023559, Example 54
Type:
Small organic molecule
Emp. Form.:
C16H15ClFN3O
Mol. Mass.:
319.761
SMILES:
FC1(Cc2ccc(NC(=O)c3ccc(Cl)nc3)cc2)CNC1
: