Target
Trace amine-associated receptor 1
Ligand
BDBM283763
Substrate
Meas. Tech.
Radioligand Binding Assay on Rat TAAR1
pH
7.4±n/a
Ki
5.00±n/a nM
Comments
extracted
Citation
 Cecere, GGalley, GNorcross, RPflieger, PRauber, E Substituted azetidine derivatives US Patent  US10023559 Publication Date 7/17/2018 
Target
Name:
Trace amine-associated receptor 1
Synonyms:
TAAR1_RAT Taar1 Trace amine receptor 1 (TARR1) Trace amine-associated receptor 1 (TAAR1) Trar1
Type:
Enzyme
Mol. Mass.:
38034.73
Organism:
Rattus norvegicus (Rat)
Description:
Q923Y9
Residue:
332
  
Inhibitor
Name:
BDBM283763
Synonyms:
N-(4-(azetidin-3-ylidenemethyl)-3-fluorophenyl)-3-ethyl-4-methyl-1H-pyrazole-5-carboxamide | US10023559, Example 88
Type:
Small organic molecule
Emp. Form.:
C17H19FN4O
Mol. Mass.:
314.3574
SMILES:
CCc1n[nH]c(C(=O)Nc2ccc(C=C3CNC3)c(F)c2)c1C
: