Target
Prokineticin receptor 2
Ligand
BDBM121157
Substrate
Meas. Tech.
Calcium Mobilization Assay
Temperature
310.15±n/a K
Ki
2.38±n/a nM
Comments
extracted
Citation
 Zhou, QLi, JHuang, Q Prokineticin receptor antagonists and uses thereof US Patent  US8722896 Publication Date 5/13/2014 
Target
Name:
Prokineticin receptor 2
Synonyms:
Prokineticin receptor 2 (PRK2)
Type:
Enzyme
Mol. Mass.:
44473.96
Organism:
Cricetulus griseus (Chinese hamster)
Description:
G3H407
Residue:
391
  
Inhibitor
Name:
BDBM121157
Synonyms:
US8722896, (+/-)-2-Methyl-3-(2,3-dihydro-1- benzofuran-7-ylmethylamino)- N-(9-chloro-3,4-dihydro-2H-1,5- benzodioxepin-7-ylmethyl)-N- isobutylpropanamide | US8722896, (-)-(2R)-2-Methyl-3-(2,3- dihydro-1-benzofuran-7- ylmethyl)-amino)-N-(9-chloro- 3,4-dihydro-2H-1,5- benzodioxepin-7-ylmethyl)-N- benzodioxepin-7-ylmethyl
Type:
Small organic molecule
Emp. Form.:
C27H35ClN2O4
Mol. Mass.:
487.031
SMILES:
CC(C)CN(Cc1cc(Cl)c2OCCCOc2c1)C(=O)C(C)CNCc1cccc2CCOc12
: