Target
Prolyl hydroxylase EGLN3
Ligand
BDBM107711
Substrate
Meas. Tech.
Mass Spectrometry Assay
Temperature
298.15±n/a K
IC50
1300±n/a nM
Comments
extracted
Citation
 Kawamoto, RMWu, SEvdokimov, AGGreis, KDBoyer, ASWarshakoon, NC Prolyl hydroxylase inhibitors and method of use US Patent  US8722895 Publication Date 5/13/2014 
Target
Name:
Prolyl hydroxylase EGLN3
Synonyms:
EGLN3 Egl nine homolog 3 (EGLIN3) | Egl nine homolog 3 (EGLN3)
Type:
Protein
Mol. Mass.:
27265.54
Organism:
Homo sapiens (Human)
Description:
Q9H6Z9
Residue:
239
  
Inhibitor
Name:
BDBM107711
Synonyms:
US11426393, Compound Table XV.17 US8722895, 17: 5-(3-Chlorophenyl)-N-(2-methylamino-2- oxoethyl)-3-hydroxypyridin-2-yl amide USRE47437, Example 5-(3-Chlorophenyl)-N-(2-methylamino-2-oxoethyl)-3-hydroxypyridin-2-yl amide
Type:
Small organic molecule
Emp. Form.:
C15H14ClN3O3
Mol. Mass.:
319.743
SMILES:
CNC(=O)CNC(=O)c1ncc(cc1O)-c1cccc(Cl)c1
: