Target
Mineralocorticoid receptor
Ligand
BDBM121400
Substrate
Meas. Tech.
Competitive Molecular Binding Assay
pH
7.4±n/a
IC50
4200±n/a nM
Comments
extracted
Citation
 Guo, XBoyer, SJWu, DWu, F Mineralocorticoid receptor antagonists US Patent  US8722709 Publication Date 5/13/2014 
Target
Name:
Mineralocorticoid receptor
Synonyms:
MCR MLR NR3C2 | Nuclear receptor subfamily 3 group C member 2
Type:
Enzyme
Mol. Mass.:
107076.42
Organism:
Homo sapiens (Human)
Description:
P08235
Residue:
984
  
Inhibitor
Name:
BDBM121400
Synonyms:
US8722709, 3
Type:
Small organic molecule
Emp. Form.:
C15H16F3N5O
Mol. Mass.:
339.3156
SMILES:
NC(=O)Nc1cc(ccn1)-c1cc(nn1C1CCCC1)C(F)(F)F
: