Target
Mineralocorticoid receptor
Ligand
BDBM121407
Substrate
Meas. Tech.
Competitive Molecular Binding Assay
pH
7.4±n/a
IC50
7900±n/a nM
Comments
extracted
Citation
 Guo, XBoyer, SJWu, DWu, F Mineralocorticoid receptor antagonists US Patent  US8722709 Publication Date 5/13/2014 
Target
Name:
Mineralocorticoid receptor
Synonyms:
MCR MLR NR3C2 | Nuclear receptor subfamily 3 group C member 2
Type:
Enzyme
Mol. Mass.:
107076.42
Organism:
Homo sapiens (Human)
Description:
P08235
Residue:
984
  
Inhibitor
Name:
BDBM121407
Synonyms:
US8722709, 10
Type:
Small organic molecule
Emp. Form.:
C12H15N5O
Mol. Mass.:
245.2804
SMILES:
CCCn1nccc1-c1ccnc(NC(N)=O)c1
: