Target
Mineralocorticoid receptor
Ligand
BDBM50398058
Substrate
Meas. Tech.
Competitive Molecular Binding Assay
pH
7.4±n/a
IC50
7.1±n/a nM
Comments
extracted
Citation
 Guo, XBoyer, SJWu, DWu, F Mineralocorticoid receptor antagonists US Patent  US8722709 Publication Date 5/13/2014 
Target
Name:
Mineralocorticoid receptor
Synonyms:
MCR MLR NR3C2 | Nuclear receptor subfamily 3 group C member 2
Type:
Enzyme
Mol. Mass.:
107076.42
Organism:
Homo sapiens (Human)
Description:
P08235
Residue:
984
  
Inhibitor
Name:
BDBM50398058
Synonyms:
CHEMBL2181933 | US8722709, 24
Type:
Small organic molecule
Emp. Form.:
C15H17N3O
Mol. Mass.:
255.315
SMILES:
Cc1ccccc1CCc1ccnc(NC(N)=O)c1
: