Target
Serine/threonine-protein kinase haspin [465-798]
Ligand
BDBM103302
Substrate
Meas. Tech.
Selectivity screening
IC50
398±0.0 nM
Citation
 Chaikuad, ATacconi, EMZimmer, JLiang, YGray, NSTarsounas, MKnapp, S A unique inhibitor binding site in ER K1/2 is associated with slow binding kinetics Nat Chem Biol 10:853-860 (2014)  
Target
Name:
Serine/threonine-protein kinase haspin [465-798]
Synonyms:
GSG2 HASP_HUMAN | Haspin (aa 465-798)
Type:
Protein
Mol. Mass.:
37973.67
Organism:
Homo sapiens (Human)
Description:
Haspin kinase domain 465-798aa (curated by PDB 4QTC)
Residue:
334
  
Inhibitor
Name:
BDBM103302
Synonyms:
SCH772984 | US8546404, 6
Type:
Small organic molecule
Emp. Form.:
C33H33N9O2
Mol. Mass.:
587.6742
SMILES:
O=C(CN1CC[C@@H](C1)C(=O)Nc1ccc2[nH]nc(-c3ccncc3)c2c1)N1CCN(CC1)c1ccc(cc1)-c1ncccn1
: