Target
Mitogen-activated protein kinase 1
Ligand
BDBM103302
Substrate
Meas. Tech.
ITC
pH
7.5±0
Temperature
288.15±0 K
Kd
233± 20 nM
Citation
 Chaikuad, ATacconi, EMZimmer, JLiang, YGray, NSTarsounas, MKnapp, S A unique inhibitor binding site in ER K1/2 is associated with slow binding kinetics Nat Chem Biol 10:853-860 (2014)  
Target
Name:
Mitogen-activated protein kinase 1
Synonyms:
ERK2 Extracellular signal-regulated kinase 2 Extracellular signal-regulated kinase 2 (ERK2) MAPK 2 MK01_HUMAN Mitogen-activated protein kinase 1 (ERK-2) Mitogen-activated protein kinase 2 PRKM2 | p42-MAPK
Type:
Ser/Thr Protein Kinase
Mol. Mass.:
41392.76
Organism:
Homo sapiens (Human)
Description:
P28482
Residue:
360
  
Inhibitor
Name:
BDBM103302
Synonyms:
SCH772984 | US8546404, 6
Type:
Small organic molecule
Emp. Form.:
C33H33N9O2
Mol. Mass.:
587.6742
SMILES:
O=C(CN1CC[C@@H](C1)C(=O)Nc1ccc2[nH]nc(-c3ccncc3)c2c1)N1CCN(CC1)c1ccc(cc1)-c1ncccn1
: