Target
Insulin-like growth factor 1 receptor
Ligand
BDBM122697
Substrate
Meas. Tech.
DELFIA assay
pH
7.4±n/a
IC50
0.6±n/a nM
Comments
extracted
Citation
 Treu, M Aminopyrazoloquinazolines US Patent  US8735386 Publication Date 5/27/2014 
Target
Name:
Insulin-like growth factor 1 receptor
Synonyms:
CD_antigen=CD221 IGF1R Insulin-like growth factor 1 receptor (IGF1R) Insulin-like growth factor 1 receptor alpha chain Insulin-like growth factor I receptor | Insulin-like growth factor receptor (IGFR)
Type:
Protein
Mol. Mass.:
154776.79
Organism:
Homo sapiens (Human)
Description:
P08069
Residue:
1367
  
Inhibitor
Name:
BDBM122697
Synonyms:
US8735386, I-167
Type:
Small organic molecule
Emp. Form.:
C28H35N9O
Mol. Mass.:
513.6372
SMILES:
COCCN1CCN(CCn2ccc(Nc3ncc4CCc5nn(C)c(c5-c4n3)-c3ccccc3)n2)CC1
: