Target
Egl nine homolog 1
Ligand
BDBM123019
Substrate
Meas. Tech.
Enzyme Assay
Temperature
298.15±n/a K
IC50
150±n/a nM
Comments
extracted
Citation
 Kang, XLong, WMa, CWang, YCao, HWang, YTan, FHu, Y Compounds as hypoxia mimetics, and compositions and uses thereof US Patent  US8742138 Publication Date 6/3/2014 
Target
Name:
Egl nine homolog 1
Synonyms:
EGLN1_RAT Hypoxia-inducible factor (HIF-PH2)
Type:
Enzyme
Mol. Mass.:
36098.74
Organism:
Rattus norvegicus (Rat)
Description:
P59722
Residue:
338
  
Inhibitor
Name:
BDBM123019
Synonyms:
US8742138, 4
Type:
Small organic molecule
Emp. Form.:
C18H12ClNO6
Mol. Mass.:
373.744
SMILES:
OC(=O)CNC(=O)c1c2cc(ccc2c(O)oc1=O)-c1ccc(Cl)cc1
: