Target
UDP-N-acetylmuramate--L-alanine ligase
Ligand
BDBM123112
Substrate
Meas. Tech.
P. aeruginosa MurC assay
Temperature
298.15±0 K
IC50
8±n/a nM
Citation
 Hameed P, SManjrekar, PChinnapattu, MHumnabadkar, VShanbhag, GKedari, CMudugal, NVAmbady, Ade Jonge, BLSadler, CPaul, BSriram, SKaur, PGuptha, SRaichurkar, AFleming, PEyermann, CJMcKinney, DCSambandamurthy, VKPanda, MRavishankar, S Pyrazolopyrimidines Establish MurC as a Vulnerable Target in Pseudomonas aeruginosa and Escherichia coli. ACS Chem Biol 9:2274-82 (2014)  
Target
Name:
UDP-N-acetylmuramate--L-alanine ligase
Synonyms:
MURC_PSEAE murC
Type:
Protein
Mol. Mass.:
51977.96
Organism:
Pseudomonas aeruginosa (G-proteobacteria)
Description:
Q9HW02
Residue:
480
  
Inhibitor
Name:
BDBM123112
Synonyms:
(S)-2-(4-(5-tert-butyl-1-methyl-1H-pyrazol-3-ylamino)-1H-pyrazolo[3,4-d]pyrimidin-6-ylamino)-2-phenylethanol (11)
Type:
Small organic molecule
Emp. Form.:
C21H26N8O
Mol. Mass.:
406.4841
SMILES:
Cn1nc(Nc2nc(N[C@H](CO)c3ccccc3)nc3n[nH]cc23)cc1C(C)(C)C
: