Target
Orexin/Hypocretin receptor type 1
Ligand
BDBM123361
Substrate
Meas. Tech.
Radioligand Binding Assay II
pH
7.5±n/a
Temperature
277.15±n/a K
Kd
4±n/a nM
Comments
extracted
Citation
 Badiger, SBehnke, DBetschart, CChaudhari, VChebrolu, MCotesta, SHintermann, SMeyer, APandit, C Disubstituted heteroaryl-fused pyridines US Patent  US8742106 Publication Date 6/3/2014 
Target
Name:
Orexin/Hypocretin receptor type 1
Synonyms:
HCRTR1 OX1R_HUMAN Orexin receptor type 1 (OR 1) Orexin receptor type 1 (OX1) Orexin receptor type 1 (OxR1) | Ox1r
Type:
Protein
Mol. Mass.:
47554.50
Organism:
Homo sapiens (Human)
Description:
O43613
Residue:
425
  
Inhibitor
Name:
BDBM123361
Synonyms:
US8742106, 5.1
Type:
Small organic molecule
Emp. Form.:
C23H25N5O2S
Mol. Mass.:
435.542
SMILES:
C[C@H](NC(=O)COc1cc(C)c2c(nn(C)c2n1)-c1nc(C)cs1)c1ccc(C)cc1
: