Target
Orexin receptor type 2
Ligand
BDBM123406
Substrate
Meas. Tech.
Radioligand Binding Assay II
pH
7.5±n/a
Temperature
277.15±n/a K
Kd
24±n/a nM
Comments
extracted
Citation
 Badiger, SBehnke, DBetschart, CChaudhari, VChebrolu, MCotesta, SHintermann, SMeyer, APandit, C Disubstituted heteroaryl-fused pyridines US Patent  US8742106 Publication Date 6/3/2014 
Target
Name:
Orexin receptor type 2
Synonyms:
HCRTR2 OX2R_HUMAN Orexin receptor type 2 (OR-2) Orexin receptor type 2 (OX2R) Ox-2-R | Ox2-R
Type:
Protein
Mol. Mass.:
50710.53
Organism:
Homo sapiens (Human)
Description:
O43614
Residue:
444
  
Inhibitor
Name:
BDBM123406
Synonyms:
US8742106, 6.5
Type:
Small organic molecule
Emp. Form.:
C23H26N4O3
Mol. Mass.:
406.4775
SMILES:
COc1ccc2[C@H](CCc2c1)NC(=O)COc1cc(C)c2c(nn(C)c2n1)C1CC1
: