Target
Interleukin-1 receptor-associated kinase 4
Ligand
BDBM283855
Substrate
Meas. Tech.
IRAK4 Inhibition Assay
pH
7.2±n/a
Temperature
298.15±n/a K
IC50
1.90±n/a nM
Comments
extracted
Citation
 Bhide, RSDuncia, JVHynes, JNair, SKPitts, WJKumar, SRGardner, DSMurugesan, NPaidi, VRSantella, JBSistla, RWu, H Heteroaryl substituted pyridyl compounds useful as kinase modulators US Patent  US10023562 Publication Date 7/17/2018 
Target
Name:
Interleukin-1 receptor-associated kinase 4
Synonyms:
IRAK-4 IRAK4_HUMAN Interleukin-1 receptor-associated kinase 4 (IRAK4) | Renal carcinoma antigen NY-REN-64
Type:
Protein
Mol. Mass.:
51519.08
Organism:
Homo sapiens (Human)
Description:
Q9NWZ3
Residue:
460
  
Inhibitor
Name:
BDBM283855
Synonyms:
US10023562, Example 47 US9657009, 47
Type:
Small organic molecule
Emp. Form.:
C20H22F2N6O2
Mol. Mass.:
416.4245
SMILES:
CC(C)(O)[C@H](F)CNC(=O)c1cnc(Nc2ncc(cc2F)C#N)cc1NC1CC1
: