Target
Interleukin-1 receptor-associated kinase 4
Ligand
BDBM283859
Substrate
Meas. Tech.
IRAK4 Inhibition Assay
pH
7.2±n/a
Temperature
298.15±n/a K
IC50
4.60±n/a nM
Comments
extracted
Citation
 Bhide, RSDuncia, JVHynes, JNair, SKPitts, WJKumar, SRGardner, DSMurugesan, NPaidi, VRSantella, JBSistla, RWu, H Heteroaryl substituted pyridyl compounds useful as kinase modulators US Patent  US10023562 Publication Date 7/17/2018 
Target
Name:
Interleukin-1 receptor-associated kinase 4
Synonyms:
IRAK-4 IRAK4_HUMAN Interleukin-1 receptor-associated kinase 4 (IRAK4) | Renal carcinoma antigen NY-REN-64
Type:
Protein
Mol. Mass.:
51519.08
Organism:
Homo sapiens (Human)
Description:
Q9NWZ3
Residue:
460
  
Inhibitor
Name:
BDBM283859
Synonyms:
US10023562, Example 51 US9657009, 51
Type:
Small organic molecule
Emp. Form.:
C19H22ClFN6O2
Mol. Mass.:
420.868
SMILES:
CCNc1cc(Nc2ncc(cc2Cl)C#N)ncc1C(=O)NC[C@@H](F)C(C)(C)O
: