Target
Glucagon receptor
Ligand
BDBM123583
Substrate
Meas. Tech.
Binding Assay
pH
7.4±n/a
Ki
27.8±n/a nM
Citation
 Chakravarty, DKreutter, KPowell, MShook, BSong, FXu, GYang, SZhang, RZhao, B Picolinamido-propanoic acid derivatives useful as glucagon receptor antagonists US Patent  US8748624 Publication Date 6/10/2014 
Target
Name:
Glucagon receptor
Synonyms:
GCGR GLR_HUMAN Glucagon receptor (GlucR)
Type:
Enzyme
Mol. Mass.:
54026.92
Organism:
Homo sapiens (Human)
Description:
P47871
Residue:
477
  
Inhibitor
Name:
BDBM123583
Synonyms:
US8748624, 75
Type:
Small organic molecule
Emp. Form.:
C30H24Cl2F3N3O3
Mol. Mass.:
602.431
SMILES:
Cc1cc(NCc2c(Cl)cc(cc2-c2ccc(nc2)C(=O)NCCC(O)=O)C(F)(F)F)ccc1-c1ccc(Cl)cc1
: