Target
Urease [D459Y,K653P]
Ligand
BDBM123732
Substrate
Meas. Tech.
Urease Inhibition Assay
Temperature
303.15±0 K
IC50
4.55e+4± 4.2e+3 nM
Citation
 Akhtar, TKhan, MAIqbal, JJones, PGHameed, S A facile one-pot synthesis of 2-arylamino-5-aryloxylalkyl-1,3,4-oxadiazoles and their urease inhibition studies. Chem Biol Drug Des 84:92-8 (2014)  
Target
Name:
Urease [D459Y,K653P]
Synonyms:
UREA_CANEN Urease
Type:
Protein
Mol. Mass.:
90763.23
Organism:
Canavalia ensiformis (Jack bean)
Description:
P07374[D459Y,K653P]
Residue:
840
  
Inhibitor
Name:
BDBM123732
Synonyms:
2-(4-Bromophenyl)amino-5-(1-(4-bromophenoxy)propyl)-1,3,4-oxadiazole (3p)
Type:
Small organic molecule
Emp. Form.:
C17H15Br2N3O2
Mol. Mass.:
453.128
SMILES:
CCC(Oc1ccc(Br)cc1)c1nnc(Nc2ccc(Br)cc2)o1
: