Target
Phospholipase D
Ligand
BDBM50345704
Substrate
Meas. Tech.
PLD In Vitro Kinetic Assay
Temperature
310.15±0 K
IC50
375±n/a nM
Citation
 Kulkarni, AQuang, PCurry, VKeyes, RZhou, WCho, HBaffoe, JTorok, BStieglitz, K 1,3-disubstituted-4-aminopyrazolo [3, 4-d] pyrimidines, a new class of potent inhibitors for phospholipase D. Chem Biol Drug Des 84:270-81 (2014)  
Target
Name:
Phospholipase D
Synonyms:
Phospholipase D (PLD_sp)
Type:
Protein
Mol. Mass.:
54006.04
Organism:
Streptomyces sp. PMF
Description:
P84147
Residue:
506
  
Inhibitor
Name:
BDBM50345704
Synonyms:
1-(tert-butyl)-3-(naphthalen-2-yl)-1H-pyrazolo[3,4-d]pyrimidin-4-amine (3) 1-tert-butyl-3-(naphthalen-2-yl)-1H-pyrazolo[3,4-d]pyrimidin-4-amine (3) CHEMBL1231371 US10544104, Compound 2 US9518026, Example 2 US9956214, Compound 2
Type:
Small organic molecule
Emp. Form.:
C19H19N5
Mol. Mass.:
317.3877
SMILES:
CC(C)(C)n1nc(-c2ccc3ccccc3c2)c2c(N)ncnc12
: