Target
Phospholipase D
Ligand
BDBM123755
Substrate
Meas. Tech.
PLD In Vitro Kinetic Assay
Temperature
310.15±0 K
IC50
695±n/a nM
Citation
 Kulkarni, AQuang, PCurry, VKeyes, RZhou, WCho, HBaffoe, JTorok, BStieglitz, K 1,3-disubstituted-4-aminopyrazolo [3, 4-d] pyrimidines, a new class of potent inhibitors for phospholipase D. Chem Biol Drug Des 84:270-81 (2014)  
Target
Name:
Phospholipase D
Synonyms:
Phospholipase D (PLD_sp)
Type:
Protein
Mol. Mass.:
54006.04
Organism:
Streptomyces sp. PMF
Description:
P84147
Residue:
506
  
Inhibitor
Name:
BDBM123755
Synonyms:
1-methyl-3-phenyl-1H-pyrazolo[3,4-d]pyrimidin-4-amine (14)
Type:
Small organic molecule
Emp. Form.:
C12H11N5
Mol. Mass.:
225.2492
SMILES:
Cn1nc(-c2ccccc2)c2c(N)ncnc12
: