Target
Rhodopsin kinase GRK1
Ligand
BDBM50173305
Substrate
Meas. Tech.
Assays for Inhibition of GRKs
pH
7±n/a
IC50
>100000±n/a nM
Comments
extracted
Citation
 Larsen, SDHoman, KWaldschmidt, HTesmer, JJ G protein-coupled receptor kinase 2 inhibitors and methods for use of the same US Patent  US10023564 Publication Date 7/17/2018 
Target
Name:
Rhodopsin kinase GRK1
Synonyms:
G protein-coupled receptor kinase 1 GRK1_HUMAN RHOK | Rhodopsin kinase
Type:
PROTEIN
Mol. Mass.:
63520.09
Organism:
Homo sapiens (Human)
Description:
ChEMBL_774378
Residue:
563
  
Inhibitor
Name:
BDBM50173305
Synonyms:
CHEMBL3810107 | US10023564, Example 3
Type:
Small organic molecule
Emp. Form.:
C27H24FN7O3
Mol. Mass.:
513.523
SMILES:
CC1=C(C(NC(=O)N1)c1ccc(F)c(c1)C(=O)NCCc1ccccn1)C(=O)Nc1ccc2[nH]ncc2c1
: