Target
Rhodopsin kinase GRK1
Ligand
BDBM50173311
Substrate
Meas. Tech.
Assays for Inhibition of GRKs
pH
7±n/a
IC50
>100000±n/a nM
Comments
extracted
Citation
 Larsen, SDHoman, KWaldschmidt, HTesmer, JJ G protein-coupled receptor kinase 2 inhibitors and methods for use of the same US Patent  US10023564 Publication Date 7/17/2018 
Target
Name:
Rhodopsin kinase GRK1
Synonyms:
G protein-coupled receptor kinase 1 GRK1_HUMAN RHOK | Rhodopsin kinase
Type:
PROTEIN
Mol. Mass.:
63520.09
Organism:
Homo sapiens (Human)
Description:
ChEMBL_774378
Residue:
563
  
Inhibitor
Name:
BDBM50173311
Synonyms:
CHEMBL3810073 | US10023564, Example 6
Type:
Small organic molecule
Emp. Form.:
C28H25FN6O4
Mol. Mass.:
528.5343
SMILES:
COc1ccc(CNC(=O)c2cc(ccc2F)C2NC(=O)NC(C)=C2C(=O)Nc2ccc3[nH]ncc3c2)cc1
: