Target
Rho-associated protein kinase 1
Ligand
BDBM50173311
Substrate
Meas. Tech.
Assays for Inhibition of ROCK
IC50
50.0±n/a nM
Citation
 Larsen, SDHoman, KWaldschmidt, HTesmer, JJ G protein-coupled receptor kinase 2 inhibitors and methods for use of the same US Patent  US10023564 Publication Date 7/17/2018 
Target
Name:
Rho-associated protein kinase 1
Synonyms:
ROCK-I ROCK1_HUMAN Rho-associated protein kinase Rho-associated, coiled-coil-containing protein kinase 1 Rho-kinase (ROCK I) p160 ROCK-1 | p160ROCK
Type:
Serine/threonine-protein kinase
Mol. Mass.:
158156.77
Organism:
Homo sapiens (Human)
Description:
Q13464
Residue:
1354
  
Inhibitor
Name:
BDBM50173311
Synonyms:
CHEMBL3810073 | US10023564, Example 6
Type:
Small organic molecule
Emp. Form.:
C28H25FN6O4
Mol. Mass.:
528.5343
SMILES:
COc1ccc(CNC(=O)c2cc(ccc2F)C2NC(=O)NC(C)=C2C(=O)Nc2ccc3[nH]ncc3c2)cc1
: