Target
Beta-adrenergic receptor kinase 1
Ligand
BDBM50173307
Substrate
Meas. Tech.
Assays for Inhibition of GRKs
pH
7±n/a
IC50
2600±n/a nM
Comments
extracted
Citation
 Larsen, SDHoman, KWaldschmidt, HTesmer, JJ G protein-coupled receptor kinase 2 inhibitors and methods for use of the same US Patent  US10023564 Publication Date 7/17/2018 
Target
Name:
Beta-adrenergic receptor kinase 1
Synonyms:
ADRBK1 BARK Beta-ARK-1 G-protein coupled receptor kinase 2 GRK2
Type:
Enzyme
Mol. Mass.:
79581.30
Organism:
Homo sapiens (Human)
Description:
P25098
Residue:
689
  
Inhibitor
Name:
BDBM50173307
Synonyms:
CHEMBL3809796 | US10023564, Example 8
Type:
Small organic molecule
Emp. Form.:
C30H24FN7O3
Mol. Mass.:
549.5551
SMILES:
CC1=C(C(NC(=O)N1)c1ccc(F)c(c1)C(=O)NCc1nccc2ccccc12)C(=O)Nc1ccc2[nH]ncc2c1
: