Target
Rho-associated protein kinase 1
Ligand
BDBM50173318
Substrate
Meas. Tech.
Assays for Inhibition of ROCK
IC50
>10000±n/a nM
Citation
 Larsen, SDHoman, KWaldschmidt, HTesmer, JJ G protein-coupled receptor kinase 2 inhibitors and methods for use of the same US Patent  US10023564 Publication Date 7/17/2018 
Target
Name:
Rho-associated protein kinase 1
Synonyms:
ROCK-I ROCK1_HUMAN Rho-associated protein kinase Rho-associated, coiled-coil-containing protein kinase 1 Rho-kinase (ROCK I) p160 ROCK-1 | p160ROCK
Type:
Serine/threonine-protein kinase
Mol. Mass.:
158156.77
Organism:
Homo sapiens (Human)
Description:
Q13464
Residue:
1354
  
Inhibitor
Name:
BDBM50173318
Synonyms:
CHEMBL3809788 | US10023564, Example 17
Type:
Small organic molecule
Emp. Form.:
C29H21F7N6O3
Mol. Mass.:
634.5043
SMILES:
CC1=C(C(NC(=O)N1)c1ccc(F)c(c1)C(=O)NCc1c(cccc1C(F)(F)F)C(F)(F)F)C(=O)Nc1ccc2[nH]ncc2c1
: