Target
Beta-adrenergic receptor kinase 1
Ligand
BDBM284011
Substrate
Meas. Tech.
Assays for Inhibition of GRKs
pH
7±n/a
IC50
4000±n/a nM
Comments
extracted
Citation
 Larsen, SDHoman, KWaldschmidt, HTesmer, JJ G protein-coupled receptor kinase 2 inhibitors and methods for use of the same US Patent  US10023564 Publication Date 7/17/2018 
Target
Name:
Beta-adrenergic receptor kinase 1
Synonyms:
ADRBK1 BARK Beta-ARK-1 G-protein coupled receptor kinase 2 GRK2
Type:
Enzyme
Mol. Mass.:
79581.30
Organism:
Homo sapiens (Human)
Description:
P25098
Residue:
689
  
Inhibitor
Name:
BDBM284011
Synonyms:
E37 | US10023564, Example 37
Type:
Small organic molecule
Emp. Form.:
C27H26FN7O4
Mol. Mass.:
531.5382
SMILES:
Cc1cnc(CNC(=O)CCc2cc(ccc2F)C2NC(=O)NC(C)=C2C(=O)Nc2ccc3[nH]ncc3c2)o1
: