Target
Integrin-linked protein kinase
Ligand
BDBM123930
Substrate
Meas. Tech.
In Vitro Ezyme Assay
Temperature
313.15±n/a K
IC50
20±n/a nM
Comments
extracted
Citation
 Zhang, ZDaynard, TSWang, SDu, XChopiuk, GBYan, JChen, JSviridov, SV Pyrazolylbenzothiazole derivatives and their use as therapeutic agents US Patent  US8754233 Publication Date 6/17/2014 
Target
Name:
Integrin-linked protein kinase
Synonyms:
ILK ILK2 Integrin-linked protein kinase (ILK) | Serine/threonine-protein kinase ILK-1
Type:
Protein
Mol. Mass.:
51429.75
Organism:
Homo sapiens (Human)
Description:
Q13418
Residue:
452
  
Inhibitor
Name:
BDBM123930
Synonyms:
US8754233, 2-(3-Amino-1H-pyrazol-4-yl)-5-fluoro-benzothiazole-6-sulfonic acid amide
Type:
Small organic molecule
Emp. Form.:
C10H8FN5O2S2
Mol. Mass.:
313.331
SMILES:
Nc1[nH]ncc1-c1nc2cc(F)c(cc2s1)S(N)(=O)=O
: