Target
Integrin-linked protein kinase
Ligand
BDBM123936
Substrate
Meas. Tech.
In Vitro Ezyme Assay
Temperature
313.15±n/a K
IC50
70±n/a nM
Comments
extracted
Citation
 Zhang, ZDaynard, TSWang, SDu, XChopiuk, GBYan, JChen, JSviridov, SV Pyrazolylbenzothiazole derivatives and their use as therapeutic agents US Patent  US8754233 Publication Date 6/17/2014 
Target
Name:
Integrin-linked protein kinase
Synonyms:
ILK ILK2 Integrin-linked protein kinase (ILK) | Serine/threonine-protein kinase ILK-1
Type:
Protein
Mol. Mass.:
51429.75
Organism:
Homo sapiens (Human)
Description:
Q13418
Residue:
452
  
Inhibitor
Name:
BDBM123936
Synonyms:
US8754233, 2-(3-Amino-5-methyl-1H-pyrazol-4-yl)-benzothiazole-6-sulfonic acid methyl amide
Type:
Small organic molecule
Emp. Form.:
C12H13N5O2S2
Mol. Mass.:
323.394
SMILES:
CNS(=O)(=O)c1ccc2nc(sc2c1)-c1c(C)[nH]nc1N
: