Target
Integrin-linked protein kinase
Ligand
BDBM123972
Substrate
Meas. Tech.
In Vitro Ezyme Assay
Temperature
313.15±n/a K
IC50
100±n/a nM
Comments
extracted
Citation
 Zhang, ZDaynard, TSWang, SDu, XChopiuk, GBYan, JChen, JSviridov, SV Pyrazolylbenzothiazole derivatives and their use as therapeutic agents US Patent  US8754233 Publication Date 6/17/2014 
Target
Name:
Integrin-linked protein kinase
Synonyms:
ILK ILK2 Integrin-linked protein kinase (ILK) | Serine/threonine-protein kinase ILK-1
Type:
Protein
Mol. Mass.:
51429.75
Organism:
Homo sapiens (Human)
Description:
Q13418
Residue:
452
  
Inhibitor
Name:
BDBM123972
Synonyms:
US8754233, 2-{[2-(5-Amino-3-methyl-1H-pyrazol-4-yl)-benzothiazol-6-ylmethyl]-amino}-ethanol
Type:
Small organic molecule
Emp. Form.:
C14H17N5OS
Mol. Mass.:
303.383
SMILES:
Cc1[nH]nc(N)c1-c1nc2ccc(CNCCO)cc2s1
: