Target
Integrin-linked protein kinase
Ligand
BDBM124022
Substrate
Meas. Tech.
In Vitro Ezyme Assay
Temperature
313.15±n/a K
IC50
20±n/a nM
Comments
extracted
Citation
 Zhang, ZDaynard, TSWang, SDu, XChopiuk, GBYan, JChen, JSviridov, SV Pyrazolylbenzothiazole derivatives and their use as therapeutic agents US Patent  US8754233 Publication Date 6/17/2014 
Target
Name:
Integrin-linked protein kinase
Synonyms:
ILK ILK2 Integrin-linked protein kinase (ILK) | Serine/threonine-protein kinase ILK-1
Type:
Protein
Mol. Mass.:
51429.75
Organism:
Homo sapiens (Human)
Description:
Q13418
Residue:
452
  
Inhibitor
Name:
BDBM124022
Synonyms:
US8754233, 4-Benzothiazol-2-yl-5-(3-methylamino-propyl)-2H-pyrazol-3-ylamine
Type:
Small organic molecule
Emp. Form.:
C14H17N5S
Mol. Mass.:
287.383
SMILES:
CNCCCc1[nH]nc(N)c1-c1nc2ccccc2s1
: